请选择 进入手机版 | 继续访问电脑版
论坛
登录 | 立即注册 设为首页收藏本站 切换到宽版
查看: 99|回复: 0

为什么按照介绍的方法编译,会出现错误,能解释一下吗

[复制链接]

1

主题

0

帖子

26

积分

新手上路

Rank: 1

积分
26
发表于 2018-12-3 20:19:03 | 显示全部楼层 |阅读模式
不会看 makefile

按照
https://wiki.ai-thinker.com/ai_ide_use
这里面的介绍,我一步步做,但eclipse  build 项目的时候,就会报错

20:15:33 **** Build of configuration Default for project ESP8266_NONOS_SDK-2.2.0 ****
make all
make[1]: Entering directory '/cygdrive/d/AiThinkerIDE_V0.5/ESP8266_NONOS_SDK-2.2.0/app'
make[2]: Entering directory '/cygdrive/d/AiThinkerIDE_V0.5/ESP8266_NONOS_SDK-2.2.0/app/user'
DEPEND: xt-xcc -M -Os -g -Wpointer-arith -Wundef -Werror -Wl,-EL -fno-inline-functions -nostdlib -mlongcalls -mtext-section-literals -ffunction-sections -fdata-sections -fno-builtin-printf -DICACHE_FLASH -I include -I ./ -I ../../include/ets -I ../include -I ../../include -I ../../include/eagle -I ../../driver_lib/include user_sensor.c
/bin/sh: line 1: xt-xcc: command not found
DEPEND: xt-xcc -M -Os -g -Wpointer-arith -Wundef -Werror -Wl,-EL -fno-inline-functions -nostdlib -mlongcalls -mtext-section-literals -ffunction-sections -fdata-sections -fno-builtin-printf -DICACHE_FLASH -I include -I ./ -I ../../include/ets -I ../include -I ../../include -I ../../include/eagle -I ../../driver_lib/include user_light.c
/bin/sh: line 1: xt-xcc: command not found
DEPEND: xt-xcc -M -Os -g -Wpointer-arith -Wundef -Werror -Wl,-EL -fno-inline-functions -nostdlib -mlongcalls -mtext-section-literals -ffunction-sections -fdata-sections -fno-builtin-printf -DICACHE_FLASH -I include -I ./ -I ../../include/ets -I ../include -I ../../include -I ../../include/eagle -I ../../driver_lib/include user_esp_platform.c
/bin/sh: line 1: xt-xcc: command not found
DEPEND: xt-xcc -M -Os -g -Wpointer-arith -Wundef -Werror -Wl,-EL -fno-inline-functions -nostdlib -mlongcalls -mtext-section-literals -ffunction-sections -fdata-sections -fno-builtin-printf -DICACHE_FLASH -I include -I ./ -I ../../include/ets -I ../include -I ../../include -I ../../include/eagle -I ../../driver_lib/include user_devicefind.c
/bin/sh: line 1: xt-xcc: command not found
DEPEND: xt-xcc -M -Os -g -Wpointer-arith -Wundef -Werror -Wl,-EL -fno-inline-functions -nostdlib -mlongcalls -mtext-section-literals -ffunction-sections -fdata-sections -fno-builtin-printf -DICACHE_FLASH -I include -I ./ -I ../../include/ets -I ../include -I ../../include -I ../../include/eagle -I ../../driver_lib/include user_plug.c
/bin/sh: line 1: xt-xcc: command not found
DEPEND: xt-xcc -M -Os -g -Wpointer-arith -Wundef -Werror -Wl,-EL -fno-inline-functions -nostdlib -mlongcalls -mtext-section-literals -ffunction-sections -fdata-sections -fno-builtin-printf -DICACHE_FLASH -I include -I ./ -I ../../include/ets -I ../include -I ../../include -I ../../include/eagle -I ../../driver_lib/include user_main.c
/bin/sh: line 1: xt-xcc: command not found
DEPEND: xt-xcc -M -Os -g -Wpointer-arith -Wundef -Werror -Wl,-EL -fno-inline-functions -nostdlib -mlongcalls -mtext-section-literals -ffunction-sections -fdata-sections -fno-builtin-printf -DICACHE_FLASH -I include -I ./ -I ../../include/ets -I ../include -I ../../include -I ../../include/eagle -I ../../driver_lib/include user_json.c
/bin/sh: line 1: xt-xcc: command not found
DEPEND: xt-xcc -M -Os -g -Wpointer-arith -Wundef -Werror -Wl,-EL -fno-inline-functions -nostdlib -mlongcalls -mtext-section-literals -ffunction-sections -fdata-sections -fno-builtin-printf -DICACHE_FLASH -I include -I ./ -I ../../include/ets -I ../include -I ../../include -I ../../include/eagle -I ../../driver_lib/include user_light_adj.c
/bin/sh: line 1: xt-xcc: command not found
DEPEND: xt-xcc -M -Os -g -Wpointer-arith -Wundef -Werror -Wl,-EL -fno-inline-functions -nostdlib -mlongcalls -mtext-section-literals -ffunction-sections -fdata-sections -fno-builtin-printf -DICACHE_FLASH -I include -I ./ -I ../../include/ets -I ../include -I ../../include -I ../../include/eagle -I ../../driver_lib/include user_webserver.c
/bin/sh: line 1: xt-xcc: command not found
DEPEND: xt-xcc -M -Os -g -Wpointer-arith -Wundef -Werror -Wl,-EL -fno-inline-functions -nostdlib -mlongcalls -mtext-section-literals -ffunction-sections -fdata-sections -fno-builtin-printf -DICACHE_FLASH -I include -I ./ -I ../../include/ets -I ../include -I ../../include -I ../../include/eagle -I ../../driver_lib/include user_esp_platform_timer.c
/bin/sh: line 1: xt-xcc: command not found
xt-xcc -Os -g -Wpointer-arith -Wundef -Werror -Wl,-EL -fno-inline-functions -nostdlib -mlongcalls -mtext-section-literals -ffunction-sections -fdata-sections -fno-builtin-printf  -DICACHE_FLASH   -I include -I ./ -I ../../include/ets -I ../include -I ../../include -I ../../include/eagle -I ../../driver_lib/include  -o .output/eagle/debug/obj/user_esp_platform_timer.o -c user_esp_platform_timer.c
make[2]: xt-xcc: Command not found
make[2]: *** [../../Makefile:345: .output/eagle/debug/obj/user_esp_platform_timer.o] Error 127
make[2]: Leaving directory '/cygdrive/d/AiThinkerIDE_V0.5/ESP8266_NONOS_SDK-2.2.0/app/user'
make[1]: *** [../Makefile:330: .subdirs] Error 2
make[1]: Leaving directory '/cygdrive/d/AiThinkerIDE_V0.5/ESP8266_NONOS_SDK-2.2.0/app'
make: *** [Makefile:330: .subdirs] Error 2

20:15:36 Build Finished (took 3s.21ms)

回复

使用道具 举报

您需要登录后才可以回帖 登录 | 立即注册

本版积分规则

手机版|小黑屋|安信可论坛    

GMT+8, 2018-12-15 15:50 , Processed in 0.017421 second(s), 13 queries , Redis On.

Powered by Discuz! X3.3

© 2001-2017 Comsenz Inc.

快速回复 返回顶部 返回列表